2022-10 Unsupported SSP Version

I just installed 2022-10 on Windows 10 x64. I am unable to build SSP 1.6.3. I receive the following console log:

Project XXX uses an unsupported SSP version.
Use e² studio 2022-07 or earlier to either continue using this project or to upgrade it to SSP 2.0.0 or later.
Build halted.

I checked the release notes prior to installing 2022-10. It stated on Page 7 that Synergy SSP1.6.X is supported with GCC 7.2.1 which is what I am using. My MCU is the S3A7.

The console log seems to indicate that only SSP 2.0.0 or later is supported.

Are SSP versions earlier than 2.0.0 supported, or is the Release Note incorrect?

  • I also tried 2022-07 and 2022-04. I could not compile the project using SSP 1.6.3 as it generated errors. The errors were along the lines of the following in the SSP files:

    Unable to obtain built macros

    I went back to 2021-04 and the project compiled correctly. Then I move to 2021-10 and it compiled correctly.

    I can try 2022-01 if that would help you. I started with a fresh workspace for each e2studio version tested.

    The answer seems to be that the Release Notes are incorrect for all 2022 versions.

  • Hi ,

    Apologies for the delayed response. How are things going? I couldn't find a note or a similar issue to this one. I will try to ask someone if there are errors in the release notes.

    JB
    If this response, or one provided by another user, answers your question, please verify the answer. Thank you!
    Renesas Engineering Community Moderator
    https://community.renesas.com/
    https://academy.renesas.com/
    https://en-support.renesas.com/knowledgeBase/

  • SSP 1.x projects are no longer supported for building in 2022-10.

    If you wish to use SSP 1.x projects please use an older e2 studio.

    SSP 2.x projects are supported as normal in e2 studio 20223-10 and onwards.

  • The e2 studio 2022-10 release note states this:

    "The Synergy Software Platform version 1.x is no longer supported in e2 studio. The ability to manipulate the encrypted software platform source files is no longer included in the product. Please use an older product before 2022-10 to use these existing projects."

    Just FYI JB (SWF)

  • I did not see this as I was searching for SSP. I should have looked for Synergy.

    At any case, I have always used the "Supported Toolchains"  section which states the Synergy Device Family and what GCC distribution and version is supported. There has no other section for SSP which states what versions are supported pre 2022-10 Release Notes.

    So, as per the table in 2022-10, I have the installed toolchains, with the versions supported, and it fails to compile. This contradicts section 4 on "What is new in 2022-10". Do you understand my confusion now?

    I think "SSP 1.6.x: 7.2.1" and "SSP 1.7.x: 7.2.1" should be removed from the table on page 7. Technically this is not supported.

    Going forward, I would recommend having an area which clearly states what SSP versions are supported, if that is the same table on page 7, or something else.

  • I just did more testing on this. SSP 1.6.3 will not compile on and e2 studio 2022-04 or newer. It does build on 2022-01 and older. I attached my build log from 2022-07 which is similar to 2022-04.

    To keep everything clean, my process to install each e2 studio was:

    • Uninstalled IDE so Renesas folder gets deleted
    • Install IDE
    • Install SSP 1.6.3
    • Create new workspace and import project
    • Clean project
    • Build project

    2022-07 SSP 1.6.3 Build Failure.txt
    Extracting support files...
    08:23:30 **** Build of configuration Debug for project zti_hal_lib ****
    make -r -j32 all 
    Building file: ../synergy/ssp/src/driver/r_sci_uart/r_sci_uart.c
    Building file: ../synergy/ssp/src/driver/r_rtc/r_rtc.c
    Building file: ../synergy/ssp/src/driver/r_rspi/r_rspi.c
    Building file: ../synergy/ssp/src/driver/r_ioport/r_ioport.c
    Building file: ../synergy/ssp/src/driver/r_icu/r_icu.c
    Building file: ../synergy/ssp/src/driver/r_gpt/r_gpt.c
    Building file: ../synergy/ssp/src/driver/r_fmi/r_fmi.c
    Building file: ../synergy/ssp/src/driver/r_flash_lp/hw/target/flash_lp_core/hw_codeflash.c
    Building file: ../synergy/ssp/src/driver/r_flash_lp/hw/target/flash_lp_core/hw_codeflash_extra.c
    Building file: ../synergy/ssp/src/driver/r_flash_lp/hw/target/flash_lp_core/hw_dataflash.c
    Building file: ../synergy/ssp/src/driver/r_flash_lp/hw/target/flash_lp_core/hw_flash_common.c
    Building file: ../synergy/ssp/src/driver/r_flash_lp/hw/target/hw_flash_lp.c
    Building file: ../synergy/ssp/src/driver/r_flash_lp/r_flash_lp.c
    Building file: ../synergy/ssp/src/driver/r_elc/r_elc.c
    Building file: ../synergy/ssp/src/driver/r_dtc/r_dtc.c
    ERROR: Unable to obtain built macros. Compiler returned the following error:  Using built-in specs.
    
    COLLECT_GCC=arm-none-eabi-gcc
    
    Target: arm-none-eabi
    
    Configured with: /tmp/jenkins/jenkins-GCC-7-build_toolchain_docker-633_20171130_1512067137/src/gcc/configure --build=x86_64-linux-gnu --host=i686-w64-mingw32 --target=arm-none-eabi --prefix=/tmp/jenkins/jenkins-GCC-7-build_toolchain_docker-633_20171130_1512067137/install-mingw --libexecdir=/tmp/jenkins/jenkins-GCC-7-build_toolchain_docker-633_20171130_1512067137/install-mingw/lib --infodir=/tmp/jenkins/jenkins-GCC-7-build_toolchain_docker-633_20171130_1512067137/install-mingw/share/doc/gcc-arm-none-eabi/info --mandir=/tmp/jenkins/jenkins-GCC-7-build_toolchain_docker-633_20171130_1512067137/install-mingw/share/doc/gcc-arm-none-eabi/man --htmldir=/tmp/jenkins/jenkins-GCC-7-build_toolchain_docker-633_20171130_1512067137/install-mingw/share/doc/gcc-arm-none-eabi/html --pdfdir=/tmp/jenkins/jenkins-GCC-7-build_toolchain_docker-633_20171130_1512067137/install-mingw/share/doc/gcc-arm-none-eabi/pdf --enable-languages=c,c++ --enable-mingw-wildcard --disable-decimal-float --disable-libffi --disable-libgomp --disable-libmudflap --disable-libquadmath --disable-libssp --disable-libstdcxx-pch --disable-nls --disable-shared --disable-threads --disable-tls --with-gnu-as --with-gnu-ld --with-headers=yes --with-newlib --with-python-dir=share/gcc-arm-none-eabi --with-sysroot=/tmp/jenkins/jenkins-GCC-7-build_toolchain_docker-633_20171130_1512067137/install-mingw/arm-none-eabi --with-libiconv-prefix=/tmp/jenkins/jenkins-GCC-7-build_toolchain_docker-633_20171130_1512067137/build-mingw/host-libs/usr --with-gmp=/tmp/jenkins/jenkins-GCC-7-build_toolchain_docker-633_20171130_1512067137/build-mingw/host-libs/usr --with-mpfr=/tmp/jenkins/jenkins-GCC-7-build_toolchain_docker-633_20171130_1512067137/build-mingw/host-libs/usr --with-mpc=/tmp/jenkins/jenkins-GCC-7-build_toolchain_docker-633_20171130_1512067137/build-mingw/host-libs/usr --with-isl=/tmp/jenkins/jenkins-GCC-7-build_toolchain_docker-633_20171130_1512067137/build-mingw/host-libs/usr --with-libelf=/tmp/jenkins/jenkins-GCC-7-build_toolchain_docker-633_20171130_1512067137/build-mingw/host-libs/usr --with-host-libstdcxx='-static-libgcc -Wl,-Bstatic,-lstdc++,-Bdynamic -lm' --with-pkgversion='GNU Tools for Arm Embedded Processors 7-2017-q4-major' --with-multilib-list=rmprofile
    
    Thread model: single
    
    gcc version 7.2.1 20170904 (release) [ARM/embedded-7-branch revision 255204] (GNU Tools for Arm Embedded Processors 7-2017-q4-major) 
    
    COLLECT_GCC_OPTIONS='-mcpu=cortex-m4' '-mthumb' '-mfloat-abi=hard' '-mfpu=fpv4-sp-d16' '-O0' '-fmessage-length=0' '-fsigned-char' '-ffunction-sections' '-fdata-sections' '-Wunused' '-Wuninitialized' '-Wall' '-Wextra' '-Wmissing-declarations' '-Wconversion' '-Wpointer-arith' '-Wshadow' '-Wlogical-op' '-Waggregate-return' '-Wfloat-equal' '-g' '-D' '_RENESAS_SYNERGY_' '-I' 'C:/Users/jerem/Source/Repos/Machine/zti_hal_lib/synergy_cfg/ssp_cfg/bsp' '-I' 'C:/Users/jerem/Source/Repos/Machine/zti_hal_lib/synergy_cfg/ssp_cfg/driver' '-I' 'C:/Users/jerem/Source/Repos/Machine/zti_hal_lib/synergy/ssp/inc' '-I' 'C:/Users/jerem/Source/Repos/Machine/zti_hal_lib/synergy/ssp/inc/bsp' '-I' 'C:/Users/jerem/Source/Repos/Machine/zti_hal_lib/synergy/ssp/inc/bsp/cmsis/Include' '-I' 'C:/Users/jerem/Source/Repos/Machine/zti_hal_lib/synergy/ssp/inc/driver/api' '-I' 'C:/Users/jerem/Source/Repos/Machine/zti_hal_lib/synergy/ssp/inc/driver/instances' '-I' 'C:/Users/jerem/Source/Repos/Machine/zti_hal_lib/src' '-I' 'C:/Users/jerem/Source/Repos/Machine/zti_hal_lib/src/synergy_gen' '-I' 'C:/Users/jerem/Source/Repos/Machine/../zti-thermx-src/' '-I' 'C:/Users/jerem/Source/Repos/Machine/../zti-thermx-src/incl/' '-std=c99' '-MMD' '-MP' '-MF' 'synergy/ssp/src/driver/r_ioport/r_ioport.d' '-MT' 'synergy/ssp/src/driver/r_ioport/r_ioport.o' '-c' '-o' 'synergy/ssp/src/driver/r_ioport/r_ioport.o' '-pipe' '-I' '../synergy/ssp/src/driver/r_rspi' '-E' '-dM' '-v' '-o' '-'
    
     c:/program files (x86)/gnu tools arm embedded/7 2017-q4-major/bin/../lib/gcc/arm-none-eabi/7.2.1/cc1.exe -E -quiet -v -I C:/Users/jerem/Source/Repos/Machine/zti_hal_lib/synergy_cfg/ssp_cfg/bsp -I C:/Users/jerem/Source/Repos/Machine/zti_hal_lib/synergy_cfg/ssp_cfg/driver -I C:/Users/jerem/Source/Repos/Machine/zti_hal_lib/synergy/ssp/inc -I C:/Users/jerem/Source/Repos/Machine/zti_hal_lib/synergy/ssp/inc/bsp -I C:/Users/jerem/Source/Repos/Machine/zti_hal_lib/synergy/ssp/inc/bsp/cmsis/Include -I C:/Users/jerem/Source/Repos/Machine/zti_hal_lib/synergy/ssp/inc/driver/api -I C:/Users/jerem/Source/Repos/Machine/zti_hal_lib/synergy/ssp/inc/driver/instances -I C:/Users/jerem/Source/Repos/Machine/zti_hal_lib/src -I C:/Users/jerem/Source/Repos/Machine/zti_hal_lib/src/synergy_gen -I C:/Users/jerem/Source/Repos/Machine/../zti-thermx-src/ -I C:/Users/jerem/Source/Repos/Machine/../zti-thermx-src/incl/ -I ../synergy/ssp/src/driver/r_rspi -imultilib thumb/v7e-m/fpv4-sp/hard -iprefix c:\program files (x86)\gnu tools arm embedded\7 2017-q4-major\bin\../lib/gcc/arm-none-eabi/7.2.1/ -isysroot c:\program files (x86)\gnu tools arm embedded\7 2017-q4-major\bin\../arm-none-eabi -MMD synergy/ssp/src/driver/r_ioport/r_ioport.d -.d -MF synergy/ssp/src/driver/r_ioport/r_ioport.d -MP -MT synergy/ssp/src/driver/r_ioport/r_ioport.o -D__USES_INITFINI__ -D _RENESAS_SYNERGY_ - -o synergy/ssp/src/driver/r_ioport/r_ioport.o -o - -mcpu=cortex-m4 -mthumb -mfloat-abi=hard -mfpu=fpv4-sp-d16 -std=c99 -Wunused -Wuninitialized -Wall -Wextra -Wmissing-declarations -Wconversion -Wpointer-arith -Wshadow -Wlogical-op -Waggregate-return -Wfloat-equal -fmessage-length=0 -fsigned-char -ffunction-sections -fdata-sections -g -fworking-directory -O0 -dM
    
    cc1.exe: error: unrecognized command line option '-.d'
    
    cc1.exe: error: output filename specified twice
    
    ignoring duplicate directory "c:/program files (x86)/gnu tools arm embedded/7 2017-q4-major/lib/gcc/../../lib/gcc/arm-none-eabi/7.2.1/include"
    
    ignoring nonexistent directory "c:\program files (x86)\gnu tools arm embedded\7 2017-q4-major\bin\../arm-none-eabi/tmp/jenkins/jenkins-GCC-7-build_toolchain_docker-633_20171130_1512067137/install-mingw/lib/gcc/arm-none-eabi/7.2.1/../../../../include"
    
    ignoring duplicate directory "c:/program files (x86)/gnu tools arm embedded/7 2017-q4-major/lib/gcc/../../lib/gcc/arm-none-eabi/7.2.1/include-fixed"
    
    ignoring duplicate directory "c:/program files (x86)/gnu tools arm embedded/7 2017-q4-major/lib/gcc/../../lib/gcc/arm-none-eabi/7.2.1/../../../../arm-none-eabi/include"
    
    ignoring nonexistent directory "c:\program files (x86)\gnu tools arm embedded\7 2017-q4-major\bin\../arm-none-eabi/usr/include"
    
    #include "..." search starts here:
    
    #include <...> search starts here:
    
     C:/Users/jerem/Source/Repos/Machine/zti_hal_lib/synergy_cfg/ssp_cfg/bsp
    
     C:/Users/jerem/Source/Repos/Machine/zti_hal_lib/synergy_cfg/ssp_cfg/driver
    
     C:/Users/jerem/Source/Repos/Machine/zti_hal_lib/synergy/ssp/inc
    
     C:/Users/jerem/Source/Repos/Machine/zti_hal_lib/synergy/ssp/inc/bsp
    
     C:/Users/jerem/Source/Repos/Machine/zti_hal_lib/synergy/ssp/inc/bsp/cmsis/Include
    
     C:/Users/jerem/Source/Repos/Machine/zti_hal_lib/synergy/ssp/inc/driver/api
    
     C:/Users/jerem/Source/Repos/Machine/zti_hal_lib/synergy/ssp/inc/driver/instances
    
     C:/Users/jerem/Source/Repos/Machine/zti_hal_lib/src
    
     C:/Users/jerem/Source/Repos/Machine/zti_hal_lib/src/synergy_gen
    
     C:/Users/jerem/Source/Repos/Machine/../zti-thermx-src
    
     C:/Users/jerem/Source/Repos/Machine/../zti-thermx-src/incl
    
     ../synergy/ssp/src/driver/r_rspi
    
     c:\program files (x86)\gnu tools arm embedded\7 2017-q4-major\bin\../lib/gcc/arm-none-eabi/7.2.1/include
    
     c:\program files (x86)\gnu tools arm embedded\7 2017-q4-major\bin\../lib/gcc/arm-none-eabi/7.2.1/include-fixed
    
     c:\program files (x86)\gnu tools arm embedded\7 2017-q4-major\bin\../lib/gcc/arm-none-eabi/7.2.1/../../../../arm-none-eabi/include
    
    End of search list.
    
    
    Building file: ../synergy/ssp/src/driver/r_cgc/r_cgc.c
    Building file: ../synergy/ssp/src/driver/r_adc/r_adc.c
    make: *** [synergy/ssp/src/driver/r_rspi/subdir.mk:25: synergy/ssp/src/driver/r_rspi/r_rspi.o] Error 1
    make: *** Waiting for unfinished jobs....
    Building file: ../synergy/ssp/src/bsp/mcu/s3a7/bsp_cache.c
    ERROR: Unable to obtain built macros. Compiler returned the following error:  Using built-in specs.
    
    COLLECT_GCC=arm-none-eabi-gcc
    
    Target: arm-none-eabi
    
    Configured with: /tmp/jenkins/jenkins-GCC-7-build_toolchain_docker-633_20171130_1512067137/src/gcc/configure --build=x86_64-linux-gnu --host=i686-w64-mingw32 --target=arm-none-eabi --prefix=/tmp/jenkins/jenkins-GCC-7-build_toolchain_docker-633_20171130_1512067137/install-mingw --libexecdir=/tmp/jenkins/jenkins-GCC-7-build_toolchain_docker-633_20171130_1512067137/install-mingw/lib --infodir=/tmp/jenkins/jenkins-GCC-7-build_toolchain_docker-633_20171130_1512067137/install-mingw/share/doc/gcc-arm-none-eabi/info --mandir=/tmp/jenkins/jenkins-GCC-7-build_toolchain_docker-633_20171130_1512067137/install-mingw/share/doc/gcc-arm-none-eabi/man --htmldir=/tmp/jenkins/jenkins-GCC-7-build_toolchain_docker-633_20171130_1512067137/install-mingw/share/doc/gcc-arm-none-eabi/html --pdfdir=/tmp/jenkins/jenkins-GCC-7-build_toolchain_docker-633_20171130_1512067137/install-mingw/share/doc/gcc-arm-none-eabi/pdf --enable-languages=c,c++ --enable-mingw-wildcard --disable-decimal-float --disable-libffi --disable-libgomp --disable-libmudflap --disable-libquadmath --disable-libssp --disable-libstdcxx-pch --disable-nls --disable-shared --disable-threads --disable-tls --with-gnu-as --with-gnu-ld --with-headers=yes --with-newlib --with-python-dir=share/gcc-arm-none-eabi --with-sysroot=/tmp/jenkins/jenkins-GCC-7-build_toolchain_docker-633_20171130_1512067137/install-mingw/arm-none-eabi --with-libiconv-prefix=/tmp/jenkins/jenkins-GCC-7-build_toolchain_docker-633_20171130_1512067137/build-mingw/host-libs/usr --with-gmp=/tmp/jenkins/jenkins-GCC-7-build_toolchain_docker-633_20171130_1512067137/build-mingw/host-libs/usr --with-mpfr=/tmp/jenkins/jenkins-GCC-7-build_toolchain_docker-633_20171130_1512067137/build-mingw/host-libs/usr --with-mpc=/tmp/jenkins/jenkins-GCC-7-build_toolchain_docker-633_20171130_1512067137/build-mingw/host-libs/usr --with-isl=/tmp/jenkins/jenkins-GCC-7-build_toolchain_docker-633_20171130_1512067137/build-mingw/host-libs/usr --with-libelf=/tmp/jenkins/jenkins-GCC-7-build_toolchain_docker-633_20171130_1512067137/build-mingw/host-libs/usr --with-host-libstdcxx='-static-libgcc -Wl,-Bstatic,-lstdc++,-Bdynamic -lm' --with-pkgversion='GNU Tools for Arm Embedded Processors 7-2017-q4-major' --with-multilib-list=rmprofile
    
    Thread model: single
    
    gcc version 7.2.1 20170904 (release) [ARM/embedded-7-branch revision 255204] (GNU Tools for Arm Embedded Processors 7-2017-q4-major) 
    
    COLLECT_GCC_OPTIONS='-mcpu=cortex-m4' '-mthumb' '-mfloat-abi=hard' '-mfpu=fpv4-sp-d16' '-O0' '-fmessage-length=0' '-fsigned-char' '-ffunction-sections' '-fdata-sections' '-Wunused' '-Wuninitialized' '-Wall' '-Wextra' '-Wmissing-declarations' '-Wconversion' '-Wpointer-arith' '-Wshadow' '-Wlogical-op' '-Waggregate-return' '-Wfloat-equal' '-g' '-D' '_RENESAS_SYNERGY_' '-I' 'C:/Users/jerem/Source/Repos/Machine/zti_hal_lib/synergy_cfg/ssp_cfg/bsp' '-I' 'C:/Users/jerem/Source/Repos/Machine/zti_hal_lib/synergy_cfg/ssp_cfg/driver' '-I' 'C:/Users/jerem/Source/Repos/Machine/zti_hal_lib/synergy/ssp/inc' '-I' 'C:/Users/jerem/Source/Repos/Machine/zti_hal_lib/synergy/ssp/inc/bsp' '-I' 'C:/Users/jerem/Source/Repos/Machine/zti_hal_lib/synergy/ssp/inc/bsp/cmsis/Include' '-I' 'C:/Users/jerem/Source/Repos/Machine/zti_hal_lib/synergy/ssp/inc/driver/api' '-I' 'C:/Users/jerem/Source/Repos/Machine/zti_hal_lib/synergy/ssp/inc/driver/instances' '-I' 'C:/Users/jerem/Source/Repos/Machine/zti_hal_lib/src' '-I' 'C:/Users/jerem/Source/Repos/Machine/zti_hal_lib/src/synergy_gen' '-I' 'C:/Users/jerem/Source/Repos/Machine/../zti-thermx-src/' '-I' 'C:/Users/jerem/Source/Repos/Machine/../zti-thermx-src/incl/' '-std=c99' '-MMD' '-MP' '-MF' 'synergy/ssp/src/driver/r_gpt/r_gpt.d' '-MT' 'synergy/ssp/src/driver/r_gpt/r_gpt.o' '-c' '-o' 'synergy/ssp/src/driver/r_gpt/r_gpt.o' '-pipe' '-I' '../synergy/ssp/src/driver/r_icu' '-E' '-dM' '-v' '-o' '-'
    
     c:/program files (x86)/gnu tools arm embedded/7 2017-q4-major/bin/../lib/gcc/arm-none-eabi/7.2.1/cc1.exe -E -quiet -v -I C:/Users/jerem/Source/Repos/Machine/zti_hal_lib/synergy_cfg/ssp_cfg/bsp -I C:/Users/jerem/Source/Repos/Machine/zti_hal_lib/synergy_cfg/ssp_cfg/driver -I C:/Users/jerem/Source/Repos/Machine/zti_hal_lib/synergy/ssp/inc -I C:/Users/jerem/Source/Repos/Machine/zti_hal_lib/synergy/ssp/inc/bsp -I C:/Users/jerem/Source/Repos/Machine/zti_hal_lib/synergy/ssp/inc/bsp/cmsis/Include -I C:/Users/jerem/Source/Repos/Machine/zti_hal_lib/synergy/ssp/inc/driver/api -I C:/Users/jerem/Source/Repos/Machine/zti_hal_lib/synergy/ssp/inc/driver/instances -I C:/Users/jerem/Source/Repos/Machine/zti_hal_lib/src -I C:/Users/jerem/Source/Repos/Machine/zti_hal_lib/src/synergy_gen -I C:/Users/jerem/Source/Repos/Machine/../zti-thermx-src/ -I C:/Users/jerem/Source/Repos/Machine/../zti-thermx-src/incl/ -I ../synergy/ssp/src/driver/r_icu -imultilib thumb/v7e-m/fpv4-sp/hard -iprefix c:\program files (x86)\gnu tools arm embedded\7 2017-q4-major\bin\../lib/gcc/arm-none-eabi/7.2.1/ -isysroot c:\program files (x86)\gnu tools arm embedded\7 2017-q4-major\bin\../arm-none-eabi -MMD synergy/ssp/src/driver/r_gpt/r_gpt.d -.d -MF synergy/ssp/src/driver/r_gpt/r_gpt.d -MP -MT synergy/ssp/src/driver/r_gpt/r_gpt.o -D__USES_INITFINI__ -D _RENESAS_SYNERGY_ - -o synergy/ssp/src/driver/r_gpt/r_gpt.o -o - -mcpu=cortex-m4 -mthumb -mfloat-abi=hard -mfpu=fpv4-sp-d16 -std=c99 -Wunused -Wuninitialized -Wall -Wextra -Wmissing-declarations -Wconversion -Wpointer-arith -Wshadow -Wlogical-op -Waggregate-return -Wfloat-equal -fmessage-length=0 -fsigned-char -ffunction-sections -fdata-sections -g -fworking-directory -O0 -dM
    
    cc1.exe: error: unrecognized command line option '-.d'
    
    cc1.exe: error: output filename specified twice
    
    ignoring duplicate directory "c:/program files (x86)/gnu tools arm embedded/7 2017-q4-major/lib/gcc/../../lib/gcc/arm-none-eabi/7.2.1/include"
    
    ignoring nonexistent directory "c:\program files (x86)\gnu tools arm embedded\7 2017-q4-major\bin\../arm-none-eabi/tmp/jenkins/jenkins-GCC-7-build_toolchain_docker-633_20171130_1512067137/install-mingw/lib/gcc/arm-none-eabi/7.2.1/../../../../include"
    
    ignoring duplicate directory "c:/program files (x86)/gnu tools arm embedded/7 2017-q4-major/lib/gcc/../../lib/gcc/arm-none-eabi/7.2.1/include-fixed"
    
    ignoring duplicate directory "c:/program files (x86)/gnu tools arm embedded/7 2017-q4-major/lib/gcc/../../lib/gcc/arm-none-eabi/7.2.1/../../../../arm-none-eabi/include"
    
    ignoring nonexistent directory "c:\program files (x86)\gnu tools arm embedded\7 2017-q4-major\bin\../arm-none-eabi/usr/include"
    
    #include "..." search starts here:
    
    #include <...> search starts here:
    
     C:/Users/jerem/Source/Repos/Machine/zti_hal_lib/synergy_cfg/ssp_cfg/bsp
    
     C:/Users/jerem/Source/Repos/Machine/zti_hal_lib/synergy_cfg/ssp_cfg/driver
    
     C:/Users/jerem/Source/Repos/Machine/zti_hal_lib/synergy/ssp/inc
    
     C:/Users/jerem/Source/Repos/Machine/zti_hal_lib/synergy/ssp/inc/bsp
    
     C:/Users/jerem/Source/Repos/Machine/zti_hal_lib/synergy/ssp/inc/bsp/cmsis/Include
    
     C:/Users/jerem/Source/Repos/Machine/zti_hal_lib/synergy/ssp/inc/driver/api
    
     C:/Users/jerem/Source/Repos/Machine/zti_hal_lib/synergy/ssp/inc/driver/instances
    
     C:/Users/jerem/Source/Repos/Machine/zti_hal_lib/src
    
     C:/Users/jerem/Source/Repos/Machine/zti_hal_lib/src/synergy_gen
    
     C:/Users/jerem/Source/Repos/Machine/../zti-thermx-src
    
     C:/Users/jerem/Source/Repos/Machine/../zti-thermx-src/incl
    
     ../synergy/ssp/src/driver/r_icu
    
     c:\program files (x86)\gnu tools arm embedded\7 2017-q4-major\bin\../lib/gcc/arm-none-eabi/7.2.1/include
    
     c:\program files (x86)\gnu tools arm embedded\7 2017-q4-major\bin\../lib/gcc/arm-none-eabi/7.2.1/include-fixed
    
     c:\program files (x86)\gnu tools arm embedded\7 2017-q4-major\bin\../lib/gcc/arm-none-eabi/7.2.1/../../../../arm-none-eabi/include
    
    End of search list.
    
    
    ERROR: Unable to obtain built macros. Compiler returned the following error:  arm-none-eabi-gcc: error: c/driver/r_flash_lp/hw/target/flash_lp_core/hw_dataflash.o: No such file or directory
    
    Using built-in specs.
    
    COLLECT_GCC=arm-none-eabi-gcc
    
    Target: arm-none-eabi
    
    Configured with: /tmp/jenkins/jenkins-GCC-7-build_toolchain_docker-633_20171130_1512067137/src/gcc/configure --build=x86_64-linux-gnu --host=i686-w64-mingw32 --target=arm-none-eabi --prefix=/tmp/jenkins/jenkins-GCC-7-build_toolchain_docker-633_20171130_1512067137/install-mingw --libexecdir=/tmp/jenkins/jenkins-GCC-7-build_toolchain_docker-633_20171130_1512067137/install-mingw/lib --infodir=/tmp/jenkins/jenkins-GCC-7-build_toolchain_docker-633_20171130_1512067137/install-mingw/share/doc/gcc-arm-none-eabi/info --mandir=/tmp/jenkins/jenkins-GCC-7-build_toolchain_docker-633_20171130_1512067137/install-mingw/share/doc/gcc-arm-none-eabi/man --htmldir=/tmp/jenkins/jenkins-GCC-7-build_toolchain_docker-633_20171130_1512067137/install-mingw/share/doc/gcc-arm-none-eabi/html --pdfdir=/tmp/jenkins/jenkins-GCC-7-build_toolchain_docker-633_20171130_1512067137/install-mingw/share/doc/gcc-arm-none-eabi/pdf --enable-languages=c,c++ --enable-mingw-wildcard --disable-decimal-float --disable-libffi --disable-libgomp --disable-libmudflap --disable-libquadmath --disable-libssp --disable-libstdcxx-pch --disable-nls --disable-shared --disable-threads --disable-tls --with-gnu-as --with-gnu-ld --with-headers=yes --with-newlib --with-python-dir=share/gcc-arm-none-eabi --with-sysroot=/tmp/jenkins/jenkins-GCC-7-build_toolchain_docker-633_20171130_1512067137/install-mingw/arm-none-eabi --with-libiconv-prefix=/tmp/jenkins/jenkins-GCC-7-build_toolchain_docker-633_20171130_1512067137/build-mingw/host-libs/usr --with-gmp=/tmp/jenkins/jenkins-GCC-7-build_toolchain_docker-633_20171130_1512067137/build-mingw/host-libs/usr --with-mpfr=/tmp/jenkins/jenkins-GCC-7-build_toolchain_docker-633_20171130_1512067137/build-mingw/host-libs/usr --with-mpc=/tmp/jenkins/jenkins-GCC-7-build_toolchain_docker-633_20171130_1512067137/build-mingw/host-libs/usr --with-isl=/tmp/jenkins/jenkins-GCC-7-build_toolchain_docker-633_20171130_1512067137/build-mingw/host-libs/usr --with-libelf=/tmp/jenkins/jenkins-GCC-7-build_toolchain_docker-633_20171130_1512067137/build-mingw/host-libs/usr --with-host-libstdcxx='-static-libgcc -Wl,-Bstatic,-lstdc++,-Bdynamic -lm' --with-pkgversion='GNU Tools for Arm Embedded Processors 7-2017-q4-major' --with-multilib-list=rmprofile
    
    Thread model: single
    
    gcc version 7.2.1 20170904 (release) [ARM/embedded-7-branch revision 255204] (GNU Tools for Arm Embedded Processors 7-2017-q4-major) 
    
    
    make: *** [synergy/ssp/src/driver/r_icu/subdir.mk:25: synergy/ssp/src/driver/r_icu/r_icu.o] Error 1
    ERROR: Unable to obtain built macros. Compiler returned the following error:  Using built-in specs.
    
    COLLECT_GCC=arm-none-eabi-gcc
    
    Target: arm-none-eabi
    
    Configured with: /tmp/jenkins/jenkins-GCC-7-build_toolchain_docker-633_20171130_1512067137/src/gcc/configure --build=x86_64-linux-gnu --host=i686-w64-mingw32 --target=arm-none-eabi --prefix=/tmp/jenkins/jenkins-GCC-7-build_toolchain_docker-633_20171130_1512067137/install-mingw --libexecdir=/tmp/jenkins/jenkins-GCC-7-build_toolchain_docker-633_20171130_1512067137/install-mingw/lib --infodir=/tmp/jenkins/jenkins-GCC-7-build_toolchain_docker-633_20171130_1512067137/install-mingw/share/doc/gcc-arm-none-eabi/info --mandir=/tmp/jenkins/jenkins-GCC-7-build_toolchain_docker-633_20171130_1512067137/install-mingw/share/doc/gcc-arm-none-eabi/man --htmldir=/tmp/jenkins/jenkins-GCC-7-build_toolchain_docker-633_20171130_1512067137/install-mingw/share/doc/gcc-arm-none-eabi/html --pdfdir=/tmp/jenkins/jenkins-GCC-7-build_toolchain_docker-633_20171130_1512067137/install-mingw/share/doc/gcc-arm-none-eabi/pdf --enable-languages=c,c++ --enable-mingw-wildcard --disable-decimal-float --disable-libffi --disable-libgomp --disable-libmudflap --disable-libquadmath --disable-libssp --disable-libstdcxx-pch --disable-nls --disable-shared --disable-threads --disable-tls --with-gnu-as --with-gnu-ld --with-headers=yes --with-newlib --with-python-dir=share/gcc-arm-none-eabi --with-sysroot=/tmp/jenkins/jenkins-GCC-7-build_toolchain_docker-633_20171130_1512067137/install-mingw/arm-none-eabi --with-libiconv-prefix=/tmp/jenkins/jenkins-GCC-7-build_toolchain_docker-633_20171130_1512067137/build-mingw/host-libs/usr --with-gmp=/tmp/jenkins/jenkins-GCC-7-build_toolchain_docker-633_20171130_1512067137/build-mingw/host-libs/usr --with-mpfr=/tmp/jenkins/jenkins-GCC-7-build_toolchain_docker-633_20171130_1512067137/build-mingw/host-libs/usr --with-mpc=/tmp/jenkins/jenkins-GCC-7-build_toolchain_docker-633_20171130_1512067137/build-mingw/host-libs/usr --with-isl=/tmp/jenkins/jenkins-GCC-7-build_toolchain_docker-633_20171130_1512067137/build-mingw/host-libs/usr --with-libelf=/tmp/jenkins/jenkins-GCC-7-build_toolchain_docker-633_20171130_1512067137/build-mingw/host-libs/usr --with-host-libstdcxx='-static-libgcc -Wl,-Bstatic,-lstdc++,-Bdynamic -lm' --with-pkgversion='GNU Tools for Arm Embedded Processors 7-2017-q4-major' --with-multilib-list=rmprofile
    
    Thread model: single
    
    gcc version 7.2.1 20170904 (release) [ARM/embedded-7-branch revision 255204] (GNU Tools for Arm Embedded Processors 7-2017-q4-major) 
    
    COLLECT_GCC_OPTIONS='-mcpu=cortex-m4' '-mthumb' '-mfloat-abi=hard' '-mfpu=fpv4-sp-d16' '-O0' '-fmessage-length=0' '-fsigned-char' '-ffunction-sections' '-fdata-sections' '-Wunused' '-Wuninitialized' '-Wall' '-Wextra' '-Wmissing-declarations' '-Wconversion' '-Wpointer-arith' '-Wshadow' '-Wlogical-op' '-Waggregate-return' '-Wfloat-equal' '-g' '-D' '_RENESAS_SYNERGY_' '-I' 'C:/Users/jerem/Source/Repos/Machine/zti_hal_lib/synergy_cfg/ssp_cfg/bsp' '-I' 'C:/Users/jerem/Source/Repos/Machine/zti_hal_lib/synergy_cfg/ssp_cfg/driver' '-I' 'C:/Users/jerem/Source/Repos/Machine/zti_hal_lib/synergy/ssp/inc' '-I' 'C:/Users/jerem/Source/Repos/Machine/zti_hal_lib/synergy/ssp/inc/bsp' '-I' 'C:/Users/jerem/Source/Repos/Machine/zti_hal_lib/synergy/ssp/inc/bsp/cmsis/Include' '-I' 'C:/Users/jerem/Source/Repos/Machine/zti_hal_lib/synergy/ssp/inc/driver/api' '-I' 'C:/Users/jerem/Source/Repos/Machine/zti_hal_lib/synergy/ssp/inc/driver/instances' '-I' 'C:/Users/jerem/Source/Repos/Machine/zti_hal_lib/src' '-I' 'C:/Users/jerem/Source/Repos/Machine/zti_hal_lib/src/synergy_gen' '-I' 'C:/Users/jerem/Source/Repos/Machine/../zti-thermx-src/' '-I' 'C:/Users/jerem/Source/Repos/Machine/../zti-thermx-src/incl/' '-std=c99' '-MMD' '-MP' '-MF' 'synergy/ssp/src/driver/r_flash_lp/hw/target/flash_lp_core/hw_codeflash.d' '-MT' 'synergy/ssp/src/driver/r_flash_lp/hw/target/flash_lp_core/hw_codeflash.o' '-c' '-o' 'synergy/ssp/src/driver/r_flash_lp/hw/target/flash_lp_core/hw_codeflash.o' '-pipe' '-I' '../synergy/ssp/src/driver/r_fmi' '-E' '-dM' '-v' '-o' '-'
    
     c:/program files (x86)/gnu tools arm embedded/7 2017-q4-major/bin/../lib/gcc/arm-none-eabi/7.2.1/cc1.exe -E -quiet -v -I C:/Users/jerem/Source/Repos/Machine/zti_hal_lib/synergy_cfg/ssp_cfg/bsp -I C:/Users/jerem/Source/Repos/Machine/zti_hal_lib/synergy_cfg/ssp_cfg/driver -I C:/Users/jerem/Source/Repos/Machine/zti_hal_lib/synergy/ssp/inc -I C:/Users/jerem/Source/Repos/Machine/zti_hal_lib/synergy/ssp/inc/bsp -I C:/Users/jerem/Source/Repos/Machine/zti_hal_lib/synergy/ssp/inc/bsp/cmsis/Include -I C:/Users/jerem/Source/Repos/Machine/zti_hal_lib/synergy/ssp/inc/driver/api -I C:/Users/jerem/Source/Repos/Machine/zti_hal_lib/synergy/ssp/inc/driver/instances -I C:/Users/jerem/Source/Repos/Machine/zti_hal_lib/src -I C:/Users/jerem/Source/Repos/Machine/zti_hal_lib/src/synergy_gen -I C:/Users/jerem/Source/Repos/Machine/../zti-thermx-src/ -I C:/Users/jerem/Source/Repos/Machine/../zti-thermx-src/incl/ -I ../synergy/ssp/src/driver/r_fmi -imultilib thumb/v7e-m/fpv4-sp/hard -iprefix c:\program files (x86)\gnu tools arm embedded\7 2017-q4-major\bin\../lib/gcc/arm-none-eabi/7.2.1/ -isysroot c:\program files (x86)\gnu tools arm embedded\7 2017-q4-major\bin\../arm-none-eabi -MMD synergy/ssp/src/driver/r_flash_lp/hw/target/flash_lp_core/hw_codeflash.d -.d -MF synergy/ssp/src/driver/r_flash_lp/hw/target/flash_lp_core/hw_codeflash.d -MP -MT synergy/ssp/src/driver/r_flash_lp/hw/target/flash_lp_core/hw_codeflash.o -D__USES_INITFINI__ -D _RENESAS_SYNERGY_ - -o synergy/ssp/src/driver/r_flash_lp/hw/target/flash_lp_core/hw_codeflash.o -o - -mcpu=cortex-m4 -mthumb -mfloat-abi=hard -mfpu=fpv4-sp-d16 -std=c99 -Wunused -Wuninitialized -Wall -Wextra -Wmissing-declarations -Wconversion -Wpointer-arith -Wshadow -Wlogical-op -Waggregate-return -Wfloat-equal -fmessage-length=0 -fsigned-char -ffunction-sections -fdata-sections -g -fworking-directory -O0 -dM
    
    cc1.exe: error: unrecognized command line option '-.d'
    
    cc1.exe: error: output filename specified twice
    
    ignoring duplicate directory "c:/program files (x86)/gnu tools arm embedded/7 2017-q4-major/lib/gcc/../../lib/gcc/arm-none-eabi/7.2.1/include"
    
    ignoring nonexistent directory "c:\program files (x86)\gnu tools arm embedded\7 2017-q4-major\bin\../arm-none-eabi/tmp/jenkins/jenkins-GCC-7-build_toolchain_docker-633_20171130_1512067137/install-mingw/lib/gcc/arm-none-eabi/7.2.1/../../../../include"
    
    ignoring duplicate directory "c:/program files (x86)/gnu tools arm embedded/7 2017-q4-major/lib/gcc/../../lib/gcc/arm-none-eabi/7.2.1/include-fixed"
    
    ignoring duplicate directory "c:/program files (x86)/gnu tools arm embedded/7 2017-q4-major/lib/gcc/../../lib/gcc/arm-none-eabi/7.2.1/../../../../arm-none-eabi/include"
    
    ignoring nonexistent directory "c:\program files (x86)\gnu tools arm embedded\7 2017-q4-major\bin\../arm-none-eabi/usr/include"
    
    #include "..." search starts here:
    
    #include <...> search starts here:
    
     C:/Users/jerem/Source/Repos/Machine/zti_hal_lib/synergy_cfg/ssp_cfg/bsp
    
     C:/Users/jerem/Source/Repos/Machine/zti_hal_lib/synergy_cfg/ssp_cfg/driver
    
     C:/Users/jerem/Source/Repos/Machine/zti_hal_lib/synergy/ssp/inc
    
     C:/Users/jerem/Source/Repos/Machine/zti_hal_lib/synergy/ssp/inc/bsp
    
     C:/Users/jerem/Source/Repos/Machine/zti_hal_lib/synergy/ssp/inc/bsp/cmsis/Include
    
    make: *** [synergy/ssp/src/driver/r_flash_lp/hw/target/flash_lp_core/subdir.mk:34: synergy/ssp/src/driver/r_flash_lp/hw/target/flash_lp_core/hw_codeflash_extra.o] Error 1
     C:/Users/jerem/Source/Repos/Machine/zti_hal_lib/synergy/ssp/inc/driver/api
    
     C:/Users/jerem/Source/Repos/Machine/zti_hal_lib/synergy/ssp/inc/driver/instances
    
     C:/Users/jerem/Source/Repos/Machine/zti_hal_lib/src
    
     C:/Users/jerem/Source/Repos/Machine/zti_hal_lib/src/synergy_gen
    
     C:/Users/jerem/Source/Repos/Machine/../zti-thermx-src
    
     C:/Users/jerem/Source/Repos/Machine/../zti-thermx-src/incl
    
     ../synergy/ssp/src/driver/r_fmi
    
     c:\program files (x86)\gnu tools arm embedded\7 2017-q4-major\bin\../lib/gcc/arm-none-eabi/7.2.1/include
    
     c:\program files (x86)\gnu tools arm embedded\7 2017-q4-major\bin\../lib/gcc/arm-none-eabi/7.2.1/include-fixed
    
     c:\program files (x86)\gnu tools arm embedded\7 2017-q4-major\bin\../lib/gcc/arm-none-eabi/7.2.1/../../../../arm-none-eabi/include
    
    End of search list.
    
    
    Building file: ../synergy/ssp/src/bsp/mcu/s3a7/bsp_clocks.c
    make: *** [synergy/ssp/src/driver/r_fmi/subdir.mk:25: synergy/ssp/src/driver/r_fmi/r_fmi.o] Error 1
    Building file: ../synergy/ssp/src/bsp/mcu/s3a7/bsp_feature.c
    ERROR: Unable to obtain built macros. Compiler returned the following error:  arm-none-eabi-gcc: error: _flash_lp/r_flash_lp.o: No such file or directory
    
    Using built-in specs.
    
    COLLECT_GCC=arm-none-eabi-gcc
    
    Target: arm-none-eabi
    
    Configured with: /tmp/jenkins/jenkins-GCC-7-build_toolchain_docker-633_20171130_1512067137/src/gcc/configure --build=x86_64-linux-gnu --host=i686-w64-mingw32 --target=arm-none-eabi --prefix=/tmp/jenkins/jenkins-GCC-7-build_toolchain_docker-633_20171130_1512067137/install-mingw --libexecdir=/tmp/jenkins/jenkins-GCC-7-build_toolchain_docker-633_20171130_1512067137/install-mingw/lib --infodir=/tmp/jenkins/jenkins-GCC-7-build_toolchain_docker-633_20171130_1512067137/install-mingw/share/doc/gcc-arm-none-eabi/info --mandir=/tmp/jenkins/jenkins-GCC-7-build_toolchain_docker-633_20171130_1512067137/install-mingw/share/doc/gcc-arm-none-eabi/man --htmldir=/tmp/jenkins/jenkins-GCC-7-build_toolchain_docker-633_20171130_1512067137/install-mingw/share/doc/gcc-arm-none-eabi/html --pdfdir=/tmp/jenkins/jenkins-GCC-7-build_toolchain_docker-633_20171130_1512067137/install-mingw/share/doc/gcc-arm-none-eabi/pdf --enable-languages=c,c++ --enable-mingw-wildcard --disable-decimal-float --disable-libffi --disable-libgomp --disable-libmudflap --disable-libquadmath --disable-libssp --disable-libstdcxx-pch --disable-nls --disable-shared --disable-threads --disable-tls --with-gnu-as --with-gnu-ld --with-headers=yes --with-newlib --with-python-dir=share/gcc-arm-none-eabi --with-sysroot=/tmp/jenkins/jenkins-GCC-7-build_toolchain_docker-633_20171130_1512067137/install-mingw/arm-none-eabi --with-libiconv-prefix=/tmp/jenkins/jenkins-GCC-7-build_toolchain_docker-633_20171130_1512067137/build-mingw/host-libs/usr --with-gmp=/tmp/jenkins/jenkins-GCC-7-build_toolchain_docker-633_20171130_1512067137/build-mingw/host-libs/usr --with-mpfr=/tmp/jenkins/jenkins-GCC-7-build_toolchain_docker-633_20171130_1512067137/build-mingw/host-libs/usr --with-mpc=/tmp/jenkins/jenkins-GCC-7-build_toolchain_docker-633_20171130_1512067137/build-mingw/host-libs/usr --with-isl=/tmp/jenkins/jenkins-GCC-7-build_toolchain_docker-633_20171130_1512067137/build-mingw/host-libs/usr --with-libelf=/tmp/jenkins/jenkins-GCC-7-build_toolchain_docker-633_20171130_1512067137/build-mingw/host-libs/usr --with-host-libstdcxx='-static-libgcc -Wl,-Bstatic,-lstdc++,-Bdynamic -lm' --with-pkgversion='GNU Tools for Arm Embedded Processors 7-2017-q4-major' --with-multilib-list=rmprofile
    
    Thread model: single
    
    gcc version 7.2.1 20170904 (release) [ARM/embedded-7-branch revision 255204] (GNU Tools for Arm Embedded Processors 7-2017-q4-major) 
    
    
    ERROR: Unable to obtain built macros. Compiler returned the following error:  Using built-in specs.
    
    COLLECT_GCC=arm-none-eabi-gcc
    
    Target: arm-none-eabi
    
    Configured with: /tmp/jenkins/jenkins-GCC-7-build_toolchain_docker-633_20171130_1512067137/src/gcc/configure --build=x86_64-linux-gnu --host=i686-w64-mingw32 --target=arm-none-eabi --prefix=/tmp/jenkins/jenkins-GCC-7-build_toolchain_docker-633_20171130_1512067137/install-mingw --libexecdir=/tmp/jenkins/jenkins-GCC-7-build_toolchain_docker-633_20171130_1512067137/install-mingw/lib --infodir=/tmp/jenkins/jenkins-GCC-7-build_toolchain_docker-633_20171130_1512067137/install-mingw/share/doc/gcc-arm-none-eabi/info --mandir=/tmp/jenkins/jenkins-GCC-7-build_toolchain_docker-633_20171130_1512067137/install-mingw/share/doc/gcc-arm-none-eabi/man --htmldir=/tmp/jenkins/jenkins-GCC-7-build_toolchain_docker-633_20171130_1512067137/install-mingw/share/doc/gcc-arm-none-eabi/html --pdfdir=/tmp/jenkins/jenkins-GCC-7-build_toolchain_docker-633_20171130_1512067137/install-mingw/share/doc/gcc-arm-none-eabi/pdf --enable-languages=c,c++ --enable-mingw-wildcard --disable-decimal-float --disable-libffi --disable-libgomp --disable-libmudflap --disable-libquadmath --disable-libssp --disable-libstdcxx-pch --disable-nls --disable-shared --disable-threads --disable-tls --with-gnu-as --with-gnu-ld --with-headers=yes --with-newlib --with-python-dir=share/gcc-arm-none-eabi --with-sysroot=/tmp/jenkins/jenkins-GCC-7-build_toolchain_docker-633_20171130_1512067137/install-mingw/arm-none-eabi --with-libiconv-prefix=/tmp/jenkins/jenkins-GCC-7-build_toolchain_docker-633_20171130_1512067137/build-mingw/host-libs/usr --with-gmp=/tmp/jenkins/jenkins-GCC-7-build_toolchain_docker-633_20171130_1512067137/build-mingw/host-libs/usr --with-mpfr=/tmp/jenkins/jenkins-GCC-7-build_toolchain_docker-633_20171130_1512067137/build-mingw/host-libs/usr --with-mpc=/tmp/jenkins/jenkins-GCC-7-build_toolchain_docker-633_20171130_1512067137/build-mingw/host-libs/usr --with-isl=/tmp/jenkins/jenkins-GCC-7-build_toolchain_docker-633_20171130_1512067137/build-mingw/host-libs/usr --with-libelf=/tmp/jenkins/jenkins-GCC-7-build_toolchain_docker-633_20171130_1512067137/build-mingw/host-libs/usr --with-host-libstdcxx='-static-libgcc -Wl,-Bstatic,-lstdc++,-Bdynamic -lm' --with-pkgversion='GNU Tools for Arm Embedded Processors 7-2017-q4-major' --with-multilib-list=rmprofile
    
    Thread model: single
    
    gcc version 7.2.1 20170904 (release) [ARM/embedded-7-branch revision 255204] (GNU Tools for Arm Embedded Processors 7-2017-q4-major) 
    
    COLLECT_GCC_OPTIONS='-mcpu=cortex-m4' '-mthumb' '-mfloat-abi=hard' '-mfpu=fpv4-sp-d16' '-O0' '-fmessage-length=0' '-fsigned-char' '-ffunction-sections' '-fdata-sections' '-Wunused' '-Wuninitialized' '-Wall' '-Wextra' '-Wmissing-declarations' '-Wconversion' '-Wpointer-arith' '-Wshadow' '-Wlogical-op' '-Waggregate-return' '-Wfloat-equal' '-g' '-D' '_RENESAS_SYNERGY_' '-I' 'C:/Users/jerem/Source/Repos/Machine/zti_hal_lib/synergy_cfg/ssp_cfg/bsp' '-I' 'C:/Users/jerem/Source/Repos/Machine/zti_hal_lib/synergy_cfg/ssp_cfg/driver' '-I' 'C:/Users/jerem/Source/Repos/Machine/zti_hal_lib/synergy/ssp/inc' '-I' 'C:/Users/jerem/Source/Repos/Machine/zti_hal_lib/synergy/ssp/inc/bsp' '-I' 'C:/Users/jerem/Source/Repos/Machine/zti_hal_lib/synergy/ssp/inc/bsp/cmsis/Include' '-I' 'C:/Users/jerem/Source/Repos/Machine/zti_hal_lib/synergy/ssp/inc/driver/api' '-I' 'C:/Users/jerem/Source/Repos/Machine/zti_hal_lib/synergy/ssp/inc/driver/instances' '-I' 'C:/Users/jerem/Source/Repos/Machine/zti_hal_lib/src' '-I' 'C:/Users/jerem/Source/Repos/Machine/zti_hal_lib/src/synergy_gen' '-I' 'C:/Users/jerem/Source/Repos/Machine/../zti-thermx-src/' '-I' 'C:/Users/jerem/Source/Repos/Machine/../zti-thermx-src/incl/' '-std=c99' '-MMD' '-MP' '-MF' 'synergy/ssp/src/driver/r_flash_lp/hw/target/flash_lp_core/hw_codeflash_extra.d' '-MT' 'synergy/ssp/src/driver/r_flash_lp/hw/target/flash_lp_core/hw_codeflash_extra.o' '-c' '-o' 'synergy/ssp/src/driver/r_flash_lp/hw/target/flash_lp_core/hw_codeflash_extra.o' '-pipe' '-I' '../synergy/ssp/src/driver/r_flash_lp/hw/target/flash_lp_core' '-E' '-dM' '-v' '-o' '-'
    
     c:/program files (x86)/gnu tools arm embedded/7 2017-q4-major/bin/../lib/gcc/arm-none-eabi/7.2.1/cc1.exe -E -quiet -v -I C:/Users/jerem/Source/Repos/Machine/zti_hal_lib/synergy_cfg/ssp_cfg/bsp -I C:/Users/jerem/Source/Repos/Machine/zti_hal_lib/synergy_cfg/ssp_cfg/driver -I C:/Users/jerem/Source/Repos/Machine/zti_hal_lib/synergy/ssp/inc -I C:/Users/jerem/Source/Repos/Machine/zti_hal_lib/synergy/ssp/inc/bsp -I C:/Users/jerem/Source/Repos/Machine/zti_hal_lib/synergy/ssp/inc/bsp/cmsis/Include -I C:/Users/jerem/Source/Repos/Machine/zti_hal_lib/synergy/ssp/inc/driver/api -I C:/Users/jerem/Source/Repos/Machine/zti_hal_lib/synergy/ssp/inc/driver/instances -I C:/Users/jerem/Source/Repos/Machine/zti_hal_lib/src -I C:/Users/jerem/Source/Repos/Machine/zti_hal_lib/src/synergy_gen -I C:/Users/jerem/Source/Repos/Machine/../zti-thermx-src/ -I C:/Users/jerem/Source/Repos/Machine/../zti-thermx-src/incl/ -I ../synergy/ssp/src/driver/r_flash_lp/hw/target/flash_lp_core -imultilib thumb/v7e-m/fpv4-sp/hard -iprefix c:\program files (x86)\gnu tools arm embedded\7 2017-q4-major\bin\../lib/gcc/arm-none-eabi/7.2.1/ -isysroot c:\program files (x86)\gnu tools arm embedded\7 2017-q4-major\bin\../arm-none-eabi -MMD synergy/ssp/src/driver/r_flash_lp/hw/target/flash_lp_core/hw_codeflash_extra.d -.d -MF synergy/ssp/src/driver/r_flash_lp/hw/target/flash_lp_core/hw_codeflash_extra.d -MP -MT synergy/ssp/src/driver/r_flash_lp/hw/target/flash_lp_core/hw_codeflash_extra.o -D__USES_INITFINI__ -D _RENESAS_SYNERGY_ - -o synergy/ssp/src/driver/r_flash_lp/hw/target/flash_lp_core/hw_codeflash_extra.o -o - -mcpu=cortex-m4 -mthumb -mfloat-abi=hard -mfpu=fpv4-sp-d16 -std=c99 -Wunused -Wuninitialized -Wall -Wextra -Wmissing-declarations -Wconversion -Wpointer-arith -Wshadow -Wlogical-op -Waggregate-return -Wfloat-equal -fmessage-length=0 -fsigned-char -ffunction-sections -fdata-sections -g -fworking-directory -O0 -dM
    
    cc1.exe: error: unrecognized command line option '-.d'
    
    cc1.exe: error: output filename specified twice
    
    ignoring duplicate directory "c:/program files (x86)/gnu tools arm embedded/7 2017-q4-major/lib/gcc/../../lib/gcc/arm-none-eabi/7.2.1/include"
    
    ignoring nonexistent directory "c:\program files (x86)\gnu tools arm embedded\7 2017-q4-major\bin\../arm-none-eabi/tmp/jenkins/jenkins-GCC-7-build_toolchain_docker-633_20171130_1512067137/install-mingw/lib/gcc/arm-none-eabi/7.2.1/../../../../include"
    
    ignoring duplicate directory "c:/program files (x86)/gnu tools arm embedded/7 2017-q4-major/lib/gcc/../../lib/gcc/arm-none-eabi/7.2.1/include-fixed"
    
    ignoring duplicate directory "c:/program files (x86)/gnu tools arm embedded/7 2017-q4-major/lib/gcc/../../lib/gcc/arm-none-eabi/7.2.1/../../../../arm-none-eabi/include"
    make: *** [synergy/ssp/src/driver/r_flash_lp/hw/target/subdir.mk:25: synergy/ssp/src/driver/r_flash_lp/hw/target/hw_flash_lp.o] Error 1
    
    ignoring nonexistent directory "c:\program files (x86)\gnu tools arm embedded\7 2017-q4-major\bin\../arm-none-eabi/usr/include"
    
    #include "..." search starts here:
    
    #include <...> search starts here:
    
     C:/Users/jerem/Source/Repos/Machine/zti_hal_lib/synergy_cfg/ssp_cfg/bsp
    
     C:/Users/jerem/Source/Repos/Machine/zti_hal_lib/synergy_cfg/ssp_cfg/driver
    
     C:/Users/jerem/Source/Repos/Machine/zti_hal_lib/synergy/ssp/inc
    
     C:/Users/jerem/Source/Repos/Machine/zti_hal_lib/synergy/ssp/inc/bsp
    
     C:/Users/jerem/Source/Repos/Machine/zti_hal_lib/synergy/ssp/inc/bsp/cmsis/Include
    
     C:/Users/jerem/Source/Repos/Machine/zti_hal_lib/synergy/ssp/inc/driver/api
    
     C:/Users/jerem/Source/Repos/Machine/zti_hal_lib/synergy/ssp/inc/driver/instances
    
     C:/Users/jerem/Source/Repos/Machine/zti_hal_lib/src
    
     C:/Users/jerem/Source/Repos/Machine/zti_hal_lib/src/synergy_gen
    
     C:/Users/jerem/Source/Repos/Machine/../zti-thermx-src
    
     C:/Users/jerem/Source/Repos/Machine/../zti-thermx-src/incl
    
     ../synergy/ssp/src/driver/r_flash_lp/hw/target/flash_lp_core
    
     c:\program files (x86)\gnu tools arm embedded\7 2017-q4-major\bin\../lib/gcc/arm-none-eabi/7.2.1/include
    
     c:\program files (x86)\gnu tools arm embedded\7 2017-q4-major\bin\../lib/gcc/arm-none-eabi/7.2.1/include-fixed
    
     c:\program files (x86)\gnu tools arm embedded\7 2017-q4-major\bin\../lib/gcc/arm-none-eabi/7.2.1/../../../../arm-none-eabi/include
    
    End of search list.
    
    
    make: *** [synergy/ssp/src/driver/r_flash_lp/hw/target/flash_lp_core/subdir.mk:34: synergy/ssp/src/driver/r_flash_lp/hw/target/flash_lp_core/hw_codeflash.o] Error 1
    ERROR: Unable to obtain built macros. Compiler returned the following error:  Using built-in specs.
    
    COLLECT_GCC=arm-none-eabi-gcc
    
    Target: arm-none-eabi
    
    Configured with: /tmp/jenkins/jenkins-GCC-7-build_toolchain_docker-633_20171130_1512067137/src/gcc/configure --build=x86_64-linux-gnu --host=i686-w64-mingw32 --target=arm-none-eabi --prefix=/tmp/jenkins/jenkins-GCC-7-build_toolchain_docker-633_20171130_1512067137/install-mingw --libexecdir=/tmp/jenkins/jenkins-GCC-7-build_toolchain_docker-633_20171130_1512067137/install-mingw/lib --infodir=/tmp/jenkins/jenkins-GCC-7-build_toolchain_docker-633_20171130_1512067137/install-mingw/share/doc/gcc-arm-none-eabi/info --mandir=/tmp/jenkins/jenkins-GCC-7-build_toolchain_docker-633_20171130_1512067137/install-mingw/share/doc/gcc-arm-none-eabi/man --htmldir=/tmp/jenkins/jenkins-GCC-7-build_toolchain_docker-633_20171130_1512067137/install-mingw/share/doc/gcc-arm-none-eabi/html --pdfdir=/tmp/jenkins/jenkins-GCC-7-build_toolchain_docker-633_20171130_1512067137/install-mingw/share/doc/gcc-arm-none-eabi/pdf --enable-languages=c,c++ --enable-mingw-wildcard --disable-decimal-float --disable-libffi --disable-libgomp --disable-libmudflap --disable-libquadmath --disable-libssp --disable-libstdcxx-pch --disable-nls --disable-shared --disable-threads --disable-tls --with-gnu-as --with-gnu-ld --with-headers=yes --with-newlib --with-python-dir=share/gcc-arm-none-eabi --with-sysroot=/tmp/jenkins/jenkins-GCC-7-build_toolchain_docker-633_20171130_1512067137/install-mingw/arm-none-eabi --with-libiconv-prefix=/tmp/jenkins/jenkins-GCC-7-build_toolchain_docker-633_20171130_1512067137/build-mingw/host-libs/usr --with-gmp=/tmp/jenkins/jenkins-GCC-7-build_toolchain_docker-633_20171130_1512067137/build-mingw/host-libs/usr --with-mpfr=/tmp/jenkins/jenkins-GCC-7-build_toolchain_docker-633_20171130_1512067137/build-mingw/host-libs/usr --with-mpc=/tmp/jenkins/jenkins-GCC-7-build_toolchain_docker-633_20171130_1512067137/build-mingw/host-libs/usr --with-isl=/tmp/jenkins/jenkins-GCC-7-build_toolchain_docker-633_20171130_1512067137/build-mingw/host-libs/usr --with-libelf=/tmp/jenkins/jenkins-GCC-7-build_toolchain_docker-633_20171130_1512067137/build-mingw/host-libs/usr --with-host-libstdcxx='-static-libgcc -Wl,-Bstatic,-lstdc++,-Bdynamic -lm' --with-pkgversion='GNU Tools for Arm Embedded Processors 7-2017-q4-major' --with-multilib-list=rmprofile
    
    Thread model: single
    
    gcc version 7.2.1 20170904 (release) [ARM/embedded-7-branch revision 255204] (GNU Tools for Arm Embedded Processors 7-2017-q4-major) 
    
    COLLECT_GCC_OPTIONS='-mcpu=cortex-m4' '-mthumb' '-mfloat-abi=hard' '-mfpu=fpv4-sp-d16' '-O0' '-fmessage-length=0' '-fsigned-char' '-ffunction-sections' '-fdata-sections' '-Wunused' '-Wuninitialized' '-Wall' '-Wextra' '-Wmissing-declarations' '-Wconversion' '-Wpointer-arith' '-Wshadow' '-Wlogical-op' '-Waggregate-return' '-Wfloat-equal' '-g' '-D' '_RENESAS_SYNERGY_' '-I' 'C:/Users/jerem/Source/Repos/Machine/zti_hal_lib/synergy_cfg/ssp_cfg/bsp' '-I' 'C:/Users/jerem/Source/Repos/Machine/zti_hal_lib/synergy_cfg/ssp_cfg/driver' '-I' 'C:/Users/jerem/Source/Repos/Machine/zti_hal_lib/synergy/ssp/inc' '-I' 'C:/Users/jerem/Source/Repos/Machine/zti_hal_lib/synergy/ssp/inc/bsp' '-I' 'C:/Users/jerem/Source/Repos/Machine/zti_hal_lib/synergy/ssp/inc/bsp/cmsis/Include' '-I' 'C:/Users/jerem/Source/Repos/Machine/zti_hal_lib/synergy/ssp/inc/driver/api' '-I' 'C:/Users/jerem/Source/Repos/Machine/zti_hal_lib/synergy/ssp/inc/driver/instances' '-I' 'C:/Users/jerem/Source/Repos/Machine/zti_hal_lib/src' '-I' 'C:/Users/jerem/Source/Repos/Machine/zti_hal_lib/src/synergy_gen' '-I' 'C:/Users/jerem/Source/Repos/Machine/../zti-thermx-src/' '-I' 'C:/Users/jerem/Source/Repos/Machine/../zti-thermx-src/incl/' '-std=c99' '-MMD' '-MP' '-MF' 'synergy/ssp/src/driver/r_flash_lp/hw/target/hw_flash_lp.d' '-MT' 'synergy/ssp/src/driver/r_flash_lp/hw/target/hw_flash_lp.o' '-c' '-o' 'synergy/ssp/src/driver/r_flash_lp/hw/target/hw_flash_lp.o' '-pipe' '-I' '../synergy/ssp/src/driver/r_flash_lp/hw/target/flash_lp_core' '-E' '-dM' '-v' '-o' '-'
    
     c:/program files (x86)/gnu tools arm embedded/7 2017-q4-major/bin/../lib/gcc/arm-none-eabi/7.2.1/cc1.exe -E -quiet -v -I C:/Users/jerem/Source/Repos/Machine/zti_hal_lib/synergy_cfg/ssp_cfg/bsp -I C:/Users/jerem/Source/Repos/Machine/zti_hal_lib/synergy_cfg/ssp_cfg/driver -I C:/Users/jerem/Source/Repos/Machine/zti_hal_lib/synergy/ssp/inc -I C:/Users/jerem/Source/Repos/Machine/zti_hal_lib/synergy/ssp/inc/bsp -I C:/Users/jerem/Source/Repos/Machine/zti_hal_lib/synergy/ssp/inc/bsp/cmsis/Include -I C:/Users/jerem/Source/Repos/Machine/zti_hal_lib/synergy/ssp/inc/driver/api -I C:/Users/jerem/Source/Repos/Machine/zti_hal_lib/synergy/ssp/inc/driver/instances -I C:/Users/jerem/Source/Repos/Machine/zti_hal_lib/src -I C:/Users/jerem/Source/Repos/Machine/zti_hal_lib/src/synergy_gen -I C:/Users/jerem/Source/Repos/Machine/../zti-thermx-src/ -I C:/Users/jerem/Source/Repos/Machine/../zti-thermx-src/incl/ -I ../synergy/ssp/src/driver/r_flash_lp/hw/target/flash_lp_core -imultilib thumb/v7e-m/fpv4-sp/hard -iprefix c:\program files (x86)\gnu tools arm embedded\7 2017-q4-major\bin\../lib/gcc/arm-none-eabi/7.2.1/ -isysroot c:\program files (x86)\gnu tools arm embedded\7 2017-q4-major\bin\../arm-none-eabi -MMD synergy/ssp/src/driver/r_flash_lp/hw/target/hw_flash_lp.d -.d -MF synergy/ssp/src/driver/r_flash_lp/hw/target/hw_flash_lp.d -MP -MT synergy/ssp/src/driver/r_flash_lp/hw/target/hw_flash_lp.o -D__USES_INITFINI__ -D _RENESAS_SYNERGY_ - -o synergy/ssp/src/driver/r_flash_lp/hw/target/hw_flash_lp.o -o - -mcpu=cortex-m4 -mthumb -mfloat-abi=hard -mfpu=fpv4-sp-d16 -std=c99 -Wunused -Wuninitialized -Wall -Wextra -Wmissing-declarations -Wconversion -Wpointer-arith -Wshadow -Wlogical-op -Waggregate-return -Wfloat-equal -fmessage-length=0 -fsigned-char -ffunction-sections -fdata-sections -g -fworking-directory -O0 -dM
    
    cc1.exe: error: unrecognized command line option '-.d'
    
    cc1.exe: error: output filename specified twice
    
    ignoring duplicate directory "c:/program files (x86)/gnu tools arm embedded/7 2017-q4-major/lib/gcc/../../lib/gcc/arm-none-eabi/7.2.1/include"
    
    ignoring nonexistent directory "c:\program files (x86)\gnu tools arm embedded\7 2017-q4-major\bin\../arm-none-eabi/tmp/jenkins/jenkins-GCC-7-build_toolchain_docker-633_20171130_1512067137/install-mingw/lib/gcc/arm-none-eabi/7.2.1/../../../../include"
    
    ignoring duplicate directory "c:/program files (x86)/gnu tools arm embedded/7 2017-q4-major/lib/gcc/../../lib/gcc/arm-none-eabi/7.2.1/include-fixed"
    
    ignoring duplicate directory "c:/program files (x86)/gnu tools arm embedded/7 2017-q4-major/lib/gcc/../../lib/gcc/arm-none-eabi/7.2.1/../../../../arm-none-eabi/include"
    
    ignoring nonexistent directory "c:\program files (x86)\gnu tools arm embedded\7 2017-q4-major\bin\../arm-none-eabi/usr/include"
    
    #include "..." search starts here:
    
    #include <...> search starts here:
    
     C:/Users/jerem/Source/Repos/Machine/zti_hal_lib/synergy_cfg/ssp_cfg/bsp
    
     C:/Users/jerem/Source/Repos/Machine/zti_hal_lib/synergy_cfg/ssp_cfg/driver
    
     C:/Users/jerem/Source/Repos/Machine/zti_hal_lib/synergy/ssp/inc
    
     C:/Users/jerem/Source/Repos/Machine/zti_hal_lib/synergy/ssp/inc/bsp
    
     C:/Users/jerem/Source/Repos/Machine/zti_hal_lib/synergy/ssp/inc/bsp/cmsis/Include
    
     C:/Users/jerem/Source/Repos/Machine/zti_hal_lib/synergy/ssp/inc/driver/api
    
     C:/Users/jerem/Source/Repos/Machine/zti_hal_lib/synergy/ssp/inc/driver/instances
    
     C:/Users/jerem/Source/Repos/Machine/zti_hal_lib/src
    
     C:/Users/jerem/Source/Repos/Machine/zti_hal_lib/src/synergy_gen
    
     C:/Users/jerem/Source/Repos/Machine/../zti-thermx-src
    
     C:/Users/jerem/Source/Repos/Machine/../zti-thermx-src/incl
    
     ../synergy/ssp/src/driver/r_flash_lp/hw/target/flash_lp_core
    
     c:\program files (x86)\gnu tools arm embedded\7 2017-q4-major\bin\../lib/gcc/arm-none-eabi/7.2.1/include
    
     c:\program files (x86)\gnu tools arm embedded\7 2017-q4-major\bin\../lib/gcc/arm-none-eabi/7.2.1/include-fixed
    
     c:\program files (x86)\gnu tools arm embedded\7 2017-q4-major\bin\../lib/gcc/arm-none-eabi/7.2.1/../../../../arm-none-eabi/include
    
    End of search list.
    
    
    make: *** [synergy/ssp/src/driver/r_flash_lp/hw/target/flash_lp_core/subdir.mk:34: synergy/ssp/src/driver/r_flash_lp/hw/target/flash_lp_core/hw_flash_common.o] Error 1
    ERROR: Unable to obtain built macros. Compiler returned the following error:  Using built-in specs.
    
    COLLECT_GCC=arm-none-eabi-gcc
    
    Target: arm-none-eabi
    
    Configured with: /tmp/jenkins/jenkins-GCC-7-build_toolchain_docker-633_20171130_1512067137/src/gcc/configure --build=x86_64-linux-gnu --host=i686-w64-mingw32 --target=arm-none-eabi --prefix=/tmp/jenkins/jenkins-GCC-7-build_toolchain_docker-633_20171130_1512067137/install-mingw --libexecdir=/tmp/jenkins/jenkins-GCC-7-build_toolchain_docker-633_20171130_1512067137/install-mingw/lib --infodir=/tmp/jenkins/jenkins-GCC-7-build_toolchain_docker-633_20171130_1512067137/install-mingw/share/doc/gcc-arm-none-eabi/info --mandir=/tmp/jenkins/jenkins-GCC-7-build_toolchain_docker-633_20171130_1512067137/install-mingw/share/doc/gcc-arm-none-eabi/man --htmldir=/tmp/jenkins/jenkins-GCC-7-build_toolchain_docker-633_20171130_1512067137/install-mingw/share/doc/gcc-arm-none-eabi/html --pdfdir=/tmp/jenkins/jenkins-GCC-7-build_toolchain_docker-633_20171130_1512067137/install-mingw/share/doc/gcc-arm-none-eabi/pdf --enable-languages=c,c++ --enable-mingw-wildcard --disable-decimal-float --disable-libffi --disable-libgomp --disable-libmudflap --disable-libquadmath --disable-libssp --disable-libstdcxx-pch --disable-nls --disable-shared --disable-threads --disable-tls --with-gnu-as --with-gnu-ld --with-headers=yes --with-newlib --with-python-dir=share/gcc-arm-none-eabi --with-sysroot=/tmp/jenkins/jenkins-GCC-7-build_toolchain_docker-633_20171130_1512067137/install-mingw/arm-none-eabi --with-libiconv-prefix=/tmp/jenkins/jenkins-GCC-7-build_toolchain_docker-633_20171130_1512067137/build-mingw/host-libs/usr --with-gmp=/tmp/jenkins/jenkins-GCC-7-build_toolchain_docker-633_20171130_1512067137/build-mingw/host-libs/usr --with-mpfr=/tmp/jenkins/jenkins-GCC-7-build_toolchain_docker-633_20171130_1512067137/build-mingw/host-libs/usr --with-mpc=/tmp/jenkins/jenkins-GCC-7-build_toolchain_docker-633_20171130_1512067137/build-mingw/host-libs/usr --with-isl=/tmp/jenkins/jenkins-GCC-7-build_toolchain_docker-633_20171130_1512067137/build-mingw/host-libs/usr --with-libelf=/tmp/jenkins/jenkins-GCC-7-build_toolchain_docker-633_20171130_1512067137/build-mingw/host-libs/usr --with-host-libstdcxx='-static-libgcc -Wl,-Bstatic,-lstdc++,-Bdynamic -lm' --with-pkgversion='GNU Tools for Arm Embedded Processors 7-2017-q4-major' --with-multilib-list=rmprofile
    
    Thread model: single
    
    gcc version 7.2.1 20170904 (release) [ARM/embedded-7-branch revision 255204] (GNU Tools for Arm Embedded Processors 7-2017-q4-major) 
    
    COLLECT_GCC_OPTIONS='-mcpu=cortex-m4' '-mthumb' '-mfloat-abi=hard' '-mfpu=fpv4-sp-d16' '-O0' '-fmessage-length=0' '-fsigned-char' '-ffunction-sections' '-fdata-sections' '-Wunused' '-Wuninitialized' '-Wall' '-Wextra' '-Wmissing-declarations' '-Wconversion' '-Wpointer-arith' '-Wshadow' '-Wlogical-op' '-Waggregate-return' '-Wfloat-equal' '-g' '-D' '_RENESAS_SYNERGY_' '-I' 'C:/Users/jerem/Source/Repos/Machine/zti_hal_lib/synergy_cfg/ssp_cfg/bsp' '-I' 'C:/Users/jerem/Source/Repos/Machine/zti_hal_lib/synergy_cfg/ssp_cfg/driver' '-I' 'C:/Users/jerem/Source/Repos/Machine/zti_hal_lib/synergy/ssp/inc' '-I' 'C:/Users/jerem/Source/Repos/Machine/zti_hal_lib/synergy/ssp/inc/bsp' '-I' 'C:/Users/jerem/Source/Repos/Machine/zti_hal_lib/synergy/ssp/inc/bsp/cmsis/Include' '-I' 'C:/Users/jerem/Source/Repos/Machine/zti_hal_lib/synergy/ssp/inc/driver/api' '-I' 'C:/Users/jerem/Source/Repos/Machine/zti_hal_lib/synergy/ssp/inc/driver/instances' '-I' 'C:/Users/jerem/Source/Repos/Machine/zti_hal_lib/src' '-I' 'C:/Users/jerem/Source/Repos/Machine/zti_hal_lib/src/synergy_gen' '-I' 'C:/Users/jerem/Source/Repos/Machine/../zti-thermx-src/' '-I' 'C:/Users/jerem/Source/Repos/Machine/../zti-thermx-src/incl/' '-std=c99' '-MMD' '-MP' '-MF' 'synergy/ssp/src/driver/r_cgc/r_cgc.d' '-MT' 'synergy/ssp/src/driver/r_cgc/r_cgc.o' '-c' '-c' '-o' 'synergy/ssp/src/bsp/mcu/s3a7/bsp_cache.o' '-pipe' '-I' '../synergy/ssp/src/driver/r_cgc' '-E' '-dM' '-v' '-o' '-'
    
     c:/program files (x86)/gnu tools arm embedded/7 2017-q4-major/bin/../lib/gcc/arm-none-eabi/7.2.1/cc1.exe -E -quiet -v -I C:/Users/jerem/Source/Repos/Machine/zti_hal_lib/synergy_cfg/ssp_cfg/bsp -I C:/Users/jerem/Source/Repos/Machine/zti_hal_lib/synergy_cfg/ssp_cfg/driver -I C:/Users/jerem/Source/Repos/Machine/zti_hal_lib/synergy/ssp/inc -I C:/Users/jerem/Source/Repos/Machine/zti_hal_lib/synergy/ssp/inc/bsp -I C:/Users/jerem/Source/Repos/Machine/zti_hal_lib/synergy/ssp/inc/bsp/cmsis/Include -I C:/Users/jerem/Source/Repos/Machine/zti_hal_lib/synergy/ssp/inc/driver/api -I C:/Users/jerem/Source/Repos/Machine/zti_hal_lib/synergy/ssp/inc/driver/instances -I C:/Users/jerem/Source/Repos/Machine/zti_hal_lib/src -I C:/Users/jerem/Source/Repos/Machine/zti_hal_lib/src/synergy_gen -I C:/Users/jerem/Source/Repos/Machine/../zti-thermx-src/ -I C:/Users/jerem/Source/Repos/Machine/../zti-thermx-src/incl/ -I ../synergy/ssp/src/driver/r_cgc -imultilib thumb/v7e-m/fpv4-sp/hard -iprefix c:\program files (x86)\gnu tools arm embedded\7 2017-q4-major\bin\../lib/gcc/arm-none-eabi/7.2.1/ -isysroot c:\program files (x86)\gnu tools arm embedded\7 2017-q4-major\bin\../arm-none-eabi -MMD synergy/ssp/src/bsp/mcu/s3a7/bsp_cache.d -.d -MF synergy/ssp/src/driver/r_cgc/r_cgc.d -MP -MT synergy/ssp/src/driver/r_cgc/r_cgc.o -D__USES_INITFINI__ -D _RENESAS_SYNERGY_ - -o synergy/ssp/src/bsp/mcu/s3a7/bsp_cache.o -o - -mcpu=cortex-m4 -mthumb -mfloat-abi=hard -mfpu=fpv4-sp-d16 -std=c99 -Wunused -Wuninitialized -Wall -Wextra -Wmissing-declarations -Wconversion -Wpointer-arith -Wshadow -Wlogical-op -Waggregate-return -Wfloat-equal -fmessage-length=0 -fsigned-char -ffunction-sections -fdata-sections -g -fworking-directory -O0 -dM
    
    cc1.exe: error: unrecognized command line option '-.d'
    
    cc1.exe: error: output filename specified twice
    
    ignoring duplicate directory "c:/program files (x86)/gnu tools arm embedded/7 2017-q4-major/lib/gcc/../../lib/gcc/arm-none-eabi/7.2.1/include"
    
    ignoring nonexistent directory "c:\program files (x86)\gnu tools arm embedded\7 2017-q4-major\bin\../arm-none-eabi/tmp/jenkins/jenkins-GCC-7-build_toolchain_docker-633_20171130_1512067137/install-mingw/lib/gcc/arm-none-eabi/7.2.1/../../../../include"
    
    ignoring duplicate directory "c:/program files (x86)/gnu tools arm embedded/7 2017-q4-major/lib/gcc/../../lib/gcc/arm-none-eabi/7.2.1/include-fixed"
    
    ignoring duplicate directory "c:/program files (x86)/gnu tools arm embedded/7 2017-q4-major/lib/gcc/../../lib/gcc/arm-none-eabi/7.2.1/../../../../arm-none-eabi/include"
    
    ignoring nonexistent directory "c:\program files (x86)\gnu tools arm embedded\7 2017-q4-major\bin\../arm-none-eabi/usr/include"
    
    #include "..." search starts here:
    
    #include <...> search starts here:
    
     C:/Users/jerem/Source/Repos/Machine/zti_hal_lib/synergy_cfg/ssp_cfg/bsp
    
     C:/Users/jerem/Source/Repos/Machine/zti_hal_lib/synergy_cfg/ssp_cfg/driver
    
     C:/Users/jerem/Source/Repos/Machine/zti_hal_lib/synergy/ssp/inc
    
     C:/Users/jerem/Source/Repos/Machine/zti_hal_lib/synergy/ssp/inc/bsp
    
     C:/Users/jerem/Source/Repos/Machine/zti_hal_lib/synergy/ssp/inc/bsp/cmsis/Include
    
     C:/Users/jerem/Source/Repos/Machine/zti_hal_lib/synergy/ssp/inc/driver/api
    
     C:/Users/jerem/Source/Repos/Machine/zti_hal_lib/synergy/ssp/inc/driver/instances
    
     C:/Users/jerem/Source/Repos/Machine/zti_hal_lib/src
    
     C:/Users/jerem/Source/Repos/Machine/zti_hal_lib/src/synergy_gen
    
     C:/Users/jerem/Source/Repos/Machine/../zti-thermx-src
    
     C:/Users/jerem/Source/Repos/Machine/../zti-thermx-src/incl
    
     ../synergy/ssp/src/driver/r_cgc
    
     c:\program files (x86)\gnu tools arm embedded\7 2017-q4-major\bin\../lib/gcc/arm-none-eabi/7.2.1/include
    
     c:\program files (x86)\gnu tools arm embedded\7 2017-q4-major\bin\../lib/gcc/arm-none-eabi/7.2.1/include-fixed
    
     c:\program files (x86)\gnu tools arm embedded\7 2017-q4-major\bin\../lib/gcc/arm-none-eabi/7.2.1/../../../../arm-none-eabi/include
    
    End of search list.
    
    
    make: *** [synergy/ssp/src/driver/r_cgc/subdir.mk:25: synergy/ssp/src/driver/r_cgc/r_cgc.o] Error 1
    "make -r -j32 all" terminated with exit code 2. Build might be incomplete.
    
    08:23:31 Build Failed. 9 errors, 0 warnings. (took 752ms)